BDBM50172498 CHEMBL3810067
SMILES O=C1c2ccccc2-c2c1c1ncccc1c(=O)n2CCCN1CCOCC1
InChI Key InChIKey=NZVQMAFQOUUMOV-UHFFFAOYSA-N
Data  2 IC50
  Tab Delimited (TSV)   2D SDfile   Computed 3D by Vconf -m prep SDfile
Find this compound or compounds like it in BindingDB:
Activity Spreadsheet -- Enzyme Inhibition Constant Data from BindingDB
Found 2 hits for monomerid = 50172498
TargetTyrosyl-DNA phosphodiesterase 2(Homo sapiens (Human))
Purdue University
Curated by ChEMBL
LigandPNGBDBM50172498(CHEMBL3810067)
Affinity DataIC50: >1.11E+5nM. Assay description: Inhibition of human recombinant TDP2 using 19-mer single stranded DNA containing 5'-phosphotyrosine as substrate after 15 mins by PAGE
In DepthDetails ArticlePubMed
TargetTyrosyl-DNA phosphodiesterase 1(Homo sapiens (Human))
Purdue University
Curated by ChEMBL
LigandPNGBDBM50172498(CHEMBL3810067)
Affinity DataIC50: >1.11E+5nM. Assay description: Inhibition of recombinant TDP1 (unknown origin) using single stranded 5'-[32P]-labeled DNA containing 3'-phosphotyrosine as substrate after 15 mins b...
In DepthDetails ArticlePubMed