BDBM50173969 (2S,4S)-1-((R)-3-(4-(benzyloxy)benzylsulfonyl)-2-amino-3-methylbutanoyl)-4-fluoropyrrolidine-2-carbonitrile::CHEMBL383573
SMILES CC(C)([C@H](N)C(=O)N1C[C@@H](F)C[C@H]1C#N)S(=O)(=O)Cc1ccc(OCc2ccccc2)cc1
InChI Key InChIKey=WALJCXHYCAPREY-JAXLGGSGSA-N
Data  3 KI
  Tab Delimited (TSV)   2D SDfile   Computed 3D by Vconf -m prep SDfile
Find this compound or compounds like it in BindingDB:
Activity Spreadsheet -- Enzyme Inhibition Constant Data from BindingDB
Found 3 hits for monomerid = 50173969
TargetDipeptidyl peptidase 4(Homo sapiens (Human))
Glaxosmithkline
Curated by ChEMBL
LigandPNGBDBM50173969((2S,4S)-1-((R)-3-(4-(benzyloxy)benzylsulfonyl)-2-a...)
Affinity DataKi:  428nM. Assay description: Inhibitory activity against human DPP4
In DepthDetails ArticlePubMed
TargetProlyl endopeptidase FAP(Homo sapiens (Human))
Glaxosmithkline
Curated by ChEMBL
LigandPNGBDBM50173969((2S,4S)-1-((R)-3-(4-(benzyloxy)benzylsulfonyl)-2-a...)
Affinity DataKi:  2.04E+4nM. Assay description: Inhibitory activity against recombinant seprase
In DepthDetails ArticlePubMed
TargetDipeptidyl peptidase 2(Homo sapiens (Human))
Glaxosmithkline
Curated by ChEMBL
LigandPNGBDBM50173969((2S,4S)-1-((R)-3-(4-(benzyloxy)benzylsulfonyl)-2-a...)
Affinity DataKi: >2.24E+4nM. Assay description: Inhibitory activity against recombinant DPP2
In DepthDetails ArticlePubMed