BDBM50175425 5-(2-chlorophenyl)furan-2-carbohydrazide::CHEMBL200849
SMILES NNC(=O)c1ccc(o1)-c1ccccc1Cl
InChI Key InChIKey=XQMRHWSGTVEDFG-UHFFFAOYSA-N
Data  9 IC50
PDB links: 2 PDB IDs match this monomer.
  Tab Delimited (TSV)   2D SDfile   Computed 3D by Vconf -m prep SDfile
Find this compound or compounds like it in BindingDB:
Activity Spreadsheet -- Enzyme Inhibition Constant Data from BindingDB
Found 9 hits for monomerid = 50175425
TargetMethionine aminopeptidase(Escherichia coli (strain K12))
Graduate School Of Chinese Academy Of Sciences
Curated by ChEMBL
LigandPNGBDBM50175425(5-(2-chlorophenyl)furan-2-carbohydrazide | CHEMBL2...)
Affinity DataIC50:  6.56E+3nM. Assay description: Inhibitory activity against Mn(II) form of Escherichia coli MetAP
TargetMethionine aminopeptidase(Escherichia coli (strain K12))
Graduate School Of Chinese Academy Of Sciences
Curated by ChEMBL
LigandPNGBDBM50175425(5-(2-chlorophenyl)furan-2-carbohydrazide | CHEMBL2...)
Affinity DataIC50:  7.71E+4nM. Assay description: Inhibitory activity against Co(II) form of Escherichia coli MetAP
TargetMethionine aminopeptidase(Escherichia coli (strain K12))
Graduate School Of Chinese Academy Of Sciences
Curated by ChEMBL
LigandPNGBDBM50175425(5-(2-chlorophenyl)furan-2-carbohydrazide | CHEMBL2...)
Affinity DataIC50:  5.78E+3nM. Assay description: Inhibitory activity against Ni(II) form of Escherichia coli MetAP
TargetMethionine aminopeptidase(Escherichia coli (strain K12))
Graduate School Of Chinese Academy Of Sciences
Curated by ChEMBL
LigandPNGBDBM50175425(5-(2-chlorophenyl)furan-2-carbohydrazide | CHEMBL2...)
Affinity DataIC50:  5.80E+4nM. Assay description: Inhibitory activity against Fe(II) form of Escherichia coli MetAP
TargetMethionine aminopeptidase(Escherichia coli (strain K12))
Graduate School Of Chinese Academy Of Sciences
Curated by ChEMBL
LigandPNGBDBM50175425(5-(2-chlorophenyl)furan-2-carbohydrazide | CHEMBL2...)
Affinity DataIC50:  7.71E+4nM. Assay description: Inhibition of Escherichia coli methionine aminopeptidase in presence of 100 uM Cobalt
TargetMethionine aminopeptidase(Escherichia coli (strain K12))
Graduate School Of Chinese Academy Of Sciences
Curated by ChEMBL
LigandPNGBDBM50175425(5-(2-chlorophenyl)furan-2-carbohydrazide | CHEMBL2...)
Affinity DataIC50:  1.16E+3nM. Assay description: Inhibition of Escherichia coli methionine aminopeptidase in presence of 5 uM Manganese
TargetMethionine aminopeptidase(Escherichia coli (strain K12))
Graduate School Of Chinese Academy Of Sciences
Curated by ChEMBL
LigandPNGBDBM50175425(5-(2-chlorophenyl)furan-2-carbohydrazide | CHEMBL2...)
Affinity DataIC50:  5.78E+3nM. Assay description: Inhibition of Escherichia coli methionine aminopeptidase in presence of 10 uM Nickel
TargetMethionine aminopeptidase(Escherichia coli (strain K12))
Graduate School Of Chinese Academy Of Sciences
Curated by ChEMBL
LigandPNGBDBM50175425(5-(2-chlorophenyl)furan-2-carbohydrazide | CHEMBL2...)
Affinity DataIC50:  6.56E+3nM. Assay description: Inhibition of Escherichia coli methionine aminopeptidase in presence of 100 uM Manganese
TargetMethionine aminopeptidase(Escherichia coli (strain K12))
Graduate School Of Chinese Academy Of Sciences
Curated by ChEMBL
LigandPNGBDBM50175425(5-(2-chlorophenyl)furan-2-carbohydrazide | CHEMBL2...)
Affinity DataIC50:  5.80E+4nM. Assay description: Inhibition of Escherichia coli methionine aminopeptidase in presence of 6 uM Iron