BDBM50176888 3-trifluoromethylphenylethanolamine::CHEMBL224618
SMILES NCC(O)c1cccc(c1)C(F)(F)F
InChI Key InChIKey=RRBRWAPWPGAJMA-UHFFFAOYSA-N
Data  1 Kd
PDB links: 1 PDB ID matches this monomer.
  Tab Delimited (TSV)   2D SDfile   Computed 3D by Vconf -m prep SDfile
Find this compound or compounds like it in BindingDB:
Activity Spreadsheet -- Enzyme Inhibition Constant Data from BindingDB
Found 1 hit for monomerid = 50176888
TargetPhenylethanolamine N-methyltransferase(Homo sapiens (Human))
University Of Michigan
Curated by ChEMBL
LigandPNGBDBM50176888(3-trifluoromethylphenylethanolamine | CHEMBL224618)
Affinity DataKd:  2.40E+3nM. Assay description: Activity of human wild type PNMT assessed as phenylethanolamine methylation