BDBM50177491 CHEMBL205173::{(S)-1-[(morpholine-4-carbonyl)-hydrazonomethyl]-pentyl}-carbamic acid tert-butyl ester
SMILES CCCC[C@H](NC(=O)OC(C)(C)C)C=NNC(=O)N1CCOCC1
InChI Key InChIKey=LOTRMFMPZMRMGH-ZDUSSCGKSA-N
Data  4 IC50
  Tab Delimited (TSV)   2D SDfile   Computed 3D by Vconf -m prep SDfile
Find this compound or compounds like it in BindingDB:
Activity Spreadsheet -- Enzyme Inhibition Constant Data from BindingDB
Found 4 hits for monomerid = 50177491
TargetPro-cathepsin H(Homo sapiens (Human))
Glaxosmithkline
Curated by ChEMBL
LigandPNGBDBM50177491(CHEMBL205173 | {(S)-1-[(morpholine-4-carbonyl)-hyd...)
Affinity DataIC50: >1.30E+4nM. Assay description: Inhibition of recombinant human cathepsin H in a fluorescence assay
In DepthDetails ArticlePubMed
TargetCathepsin K(Homo sapiens (Human))
Glaxosmithkline
Curated by ChEMBL
LigandPNGBDBM50177491(CHEMBL205173 | {(S)-1-[(morpholine-4-carbonyl)-hyd...)
Affinity DataIC50:  35nM. Assay description: Inhibition of recombinant human cathepsin K in a fluorescence assay
In DepthDetails ArticlePubMed
TargetCathepsin B(Homo sapiens (Human))
Glaxosmithkline
Curated by ChEMBL
LigandPNGBDBM50177491(CHEMBL205173 | {(S)-1-[(morpholine-4-carbonyl)-hyd...)
Affinity DataIC50:  3.20E+4nM. Assay description: Inhibition of recombinant human cathepsin B in a fluorescence assay
In DepthDetails ArticlePubMed
TargetProcathepsin L(Homo sapiens (Human))
Glaxosmithkline
Curated by ChEMBL
LigandPNGBDBM50177491(CHEMBL205173 | {(S)-1-[(morpholine-4-carbonyl)-hyd...)
Affinity DataIC50:  1.10E+4nM. Assay description: Inhibition of recombinant human cathepsin L in a fluorescence assay
In DepthDetails ArticlePubMed