BDBM50177652 2-(2,3-dihydro-1H-inden-5-ylamino)-6-hydroxy-5-(4-phenoxybutyl)pyrimidin-4(3H)-one::CHEMBL203997
SMILES Oc1nc(Nc2ccc3CCCc3c2)[nH]c(=O)c1CCCCOc1ccccc1
InChI Key InChIKey=MPKRFPQLEXMVEM-UHFFFAOYSA-N
Data  1 IC50
  Tab Delimited (TSV)   2D SDfile   Computed 3D by Vconf -m prep SDfile
Find this compound or compounds like it in BindingDB:
Activity Spreadsheet -- Enzyme Inhibition Constant Data from BindingDB
Found 1 hit for monomerid = 50177652
TargetDNA polymerase III PolC-type(Staphylococcus aureus)
Targanta Therapeutics
Curated by ChEMBL
LigandPNGBDBM50177652(2-(2,3-dihydro-1H-inden-5-ylamino)-6-hydroxy-5-(4-...)
Affinity DataIC50:  1.40E+4nM. Assay description: Inhibition of DNA polymerase3C from Staphylococcus aureus
In DepthDetails ArticlePubMed