BDBM50177653 5-allyl-6-chloro-2-(2,3-dihydro-1H-inden-5-ylamino)pyrimidin-4(3H)-one::CHEMBL202084
SMILES Clc1nc(Nc2ccc3CCCc3c2)[nH]c(=O)c1CC=C
InChI Key InChIKey=UOHNQYCQYATDNL-UHFFFAOYSA-N
Data  1 IC50
  Tab Delimited (TSV)   2D SDfile   Computed 3D by Vconf -m prep SDfile
Find this compound or compounds like it in BindingDB:
Activity Spreadsheet -- Enzyme Inhibition Constant Data from BindingDB
Found 1 hit for monomerid = 50177653
TargetDNA polymerase III PolC-type(Staphylococcus aureus)
Targanta Therapeutics
Curated by ChEMBL
LigandPNGBDBM50177653(5-allyl-6-chloro-2-(2,3-dihydro-1H-inden-5-ylamino...)
Affinity DataIC50:  2.30E+3nM. Assay description: Inhibition of DNA polymerase3C from Staphylococcus aureus
In DepthDetails ArticlePubMed