BDBM50177660 2-(2,3-dihydro-1H-inden-5-ylamino)-6-hydroxy-5-(3-(4-methoxyphenoxy)propyl)pyrimidin-4(3H)-one::CHEMBL371253
SMILES COc1ccc(OCCCc2c(O)nc(Nc3ccc4CCCc4c3)[nH]c2=O)cc1
InChI Key InChIKey=BRJMSKHFEYVAAH-UHFFFAOYSA-N
Data  1 IC50
  Tab Delimited (TSV)   2D SDfile   Computed 3D by Vconf -m prep SDfile
Find this compound or compounds like it in BindingDB:
Activity Spreadsheet -- Enzyme Inhibition Constant Data from BindingDB
Found 1 hit for monomerid = 50177660
TargetDNA polymerase III PolC-type(Staphylococcus aureus)
Targanta Therapeutics
Curated by ChEMBL
LigandPNGBDBM50177660(2-(2,3-dihydro-1H-inden-5-ylamino)-6-hydroxy-5-(3-...)
Affinity DataIC50:  1.16E+4nM. Assay description: Inhibition of DNA polymerase3C from Staphylococcus aureus
In DepthDetails ArticlePubMed