BDBM50182481 CHEMBL3818698
SMILES O[C@@H]1C=C(C[C@H]([C@@H]1O)n1cc(COc2ccccc2)nn1)C(O)=O
InChI Key InChIKey=DQILQRGUJCOKQW-KFWWJZLASA-N
Data  1 KI
  Tab Delimited (TSV)   2D SDfile   Computed 3D by Vconf -m prep SDfile
Find this compound or compounds like it in BindingDB:
Activity Spreadsheet -- Enzyme Inhibition Constant Data from BindingDB
Found 1 hit for monomerid = 50182481
TargetShikimate kinase(Helicobacter pylori (strain ATCC 700392 / 26695) (...)
Universidade De Santiago De Compostela
Curated by ChEMBL
LigandPNGBDBM50182481(CHEMBL3818698)
Affinity DataKi:  6.70E+4nM. Assay description: Inhibition of Helicobacter pylori shikimate kinase using shikimic acid substrate by measuring oxidation of NADH to NAD by pyruvate kinase and lactate...
In DepthDetails ArticlePubMed