BDBM50183152 CHEMBL206580::N-(4-(trifluoromethyl)benzyl)-N-isobutylpiperidin-4-amine fumaric acid salt
SMILES CC(C)CN(Cc1ccc(cc1)C(F)(F)F)C1CCNCC1
InChI Key InChIKey=ZRZJDCNJTXKTEF-UHFFFAOYSA-N
Data  2 KI
  Tab Delimited (TSV)   2D SDfile   Computed 3D by Vconf -m prep SDfile
Find this compound or compounds like it in BindingDB:
Activity Spreadsheet -- Enzyme Inhibition Constant Data from BindingDB
Found 2 hits for monomerid = 50183152
TargetSodium-dependent serotonin transporter(Homo sapiens (Human))
Eli Lilly
Curated by ChEMBL
LigandPNGBDBM50183152(CHEMBL206580 | N-(4-(trifluoromethyl)benzyl)-N-iso...)
Affinity DataKi:  0.0700nM. Assay description: Displacement of [3H]citalopram from SERT
In DepthDetails ArticlePubMed
TargetSodium-dependent noradrenaline transporter(Homo sapiens (Human))
Eli Lilly
Curated by ChEMBL
LigandPNGBDBM50183152(CHEMBL206580 | N-(4-(trifluoromethyl)benzyl)-N-iso...)
Affinity DataKi:  300nM. Assay description: Displacement of [3H]nisoxetine from NET
In DepthDetails ArticlePubMed