BDBM50184637 6-(3-chlorophenyl)-2,4,6-trioxohexanoic acid::CHEMBL210870
SMILES OC(=O)C(=O)CC(=O)CC(=O)c1cccc(Cl)c1
InChI Key InChIKey=HHYZZYYFJVKCCO-UHFFFAOYSA-N
Data  1 IC50
  Tab Delimited (TSV)   2D SDfile   Computed 3D by Vconf -m prep SDfile
Find this compound or compounds like it in BindingDB:
Activity Spreadsheet -- Enzyme Inhibition Constant Data from BindingDB
Found 1 hit for monomerid = 50184637
TargetIntegrase(Human immunodeficiency virus 1)
Bristol-Myers Squibb
Curated by ChEMBL
LigandPNGBDBM50184637(6-(3-chlorophenyl)-2,4,6-trioxohexanoic acid | CHE...)
Affinity DataIC50:  8.00E+3nM. Assay description: Inhibition of HIV1 recombinant integrase
In DepthDetails ArticlePubMed