BDBM50187631 4-nitro-N-(1-(2-bromophenyl)-3-phenyl-1H-pyrazol-5-yl)benzamide::CHEMBL206992
SMILES [O-][N+](=O)c1ccc(cc1)C(=O)Nc1cc(nn1-c1ccccc1Br)-c1ccccc1
InChI Key InChIKey=GFWHHPKVTZVFDX-UHFFFAOYSA-N
Data  1 KI  1 EC50
  Tab Delimited (TSV)   2D SDfile   Computed 3D by Vconf -m prep SDfile
Find this compound or compounds like it in BindingDB:
Activity Spreadsheet -- Enzyme Inhibition Constant Data from BindingDB
Found 2 hits for monomerid = 50187631
TargetMetabotropic glutamate receptor 5(Rattus norvegicus (Rat))
Vanderbilt University School Of Medicine
Curated by ChEMBL
LigandPNGBDBM50187631(4-nitro-N-(1-(2-bromophenyl)-3-phenyl-1H-pyrazol-5...)
Affinity DataKi:  120nM. Assay description: Displacement of [3H]methoxyPEPy from rat mGluR5 expressed in HEK293 cells
In DepthDetails ArticlePubMed
TargetMetabotropic glutamate receptor 5(Rattus norvegicus (Rat))
Vanderbilt University School Of Medicine
Curated by ChEMBL
LigandPNGBDBM50187631(4-nitro-N-(1-(2-bromophenyl)-3-phenyl-1H-pyrazol-5...)
Affinity DataEC50:  61nM. Assay description: Activity at mGluR5 assessed as potentiation of glutamate-induced calcium flux in rat astrocytes
In DepthDetails ArticlePubMed