BDBM50189697 CHEMBL3827733
SMILES CCS(=O)(=O)Nc1c(C)cc(OCC(=O)N2CCN(CC2)C(=O)c2cccc(OC)c2OC)cc1C
InChI Key InChIKey=QMQHZVSJVVBADA-UHFFFAOYSA-N
Data  1 KI
  Tab Delimited (TSV)   2D SDfile   Computed 3D by Vconf -m prep SDfile
Find this compound or compounds like it in BindingDB:
Activity Spreadsheet -- Enzyme Inhibition Constant Data from BindingDB
Found 1 hit for monomerid = 50189697
TargetChromobox protein homolog 7(Homo sapiens (Human))
Icahn School Of Medicine At Mount Sinai
Curated by ChEMBL
LigandPNGBDBM50189697(CHEMBL3827733)
Affinity DataKi:  1.00E+4nM. Assay description: Binding affinity to CBX7ChD (7 to 66 residues) (unknown origin) expressed in RIPL-BL21 (DE3)-CodonPlus competent cells in presence of FITC-labeled SE...
In DepthDetails ArticlePubMed