BDBM50190502 6-bromo-3-(1-methylcyclopropyl)amino-4H-thieno[3,2-e]-1,2,4-thiadiazine 1,1-dioxide::CHEMBL210749
SMILES CC1(CC1)NC1=Nc2cc(Br)sc2S(=O)(=O)N1
InChI Key InChIKey=FQYXGDJEJHILEX-UHFFFAOYSA-N
Data  1 EC50
  Tab Delimited (TSV)   2D SDfile   Computed 3D by Vconf -m prep SDfile
Find this compound or compounds like it in BindingDB:
Activity Spreadsheet -- Enzyme Inhibition Constant Data from BindingDB
Found 1 hit for monomerid = 50190502
TargetATP-binding cassette sub-family C member 8/ATP-sensitive inward rectifier potassium channel 11(Homo sapiens (Human))
Novo Nordisk Research And Development
Curated by ChEMBL
LigandPNGBDBM50190502(6-bromo-3-(1-methylcyclopropyl)amino-4H-thieno[3,2...)
Affinity DataEC50:  160nM. Assay description: Repolarization of HEK293 cells expressing Kir6.2/SUR1 KATP channels
In DepthDetails ArticlePubMed