BDBM50191171 2-(4-flurophenyl)-1,10b-dihydro-benzo[e]pyrazolo[1,5-c][1,3]oxazine-5-spiro-4'-(1'-propylpiperidine)::CHEMBL214554
SMILES CCCN1CCC2(CC1)Oc1ccccc1C1CC(=NN21)c1ccc(F)cc1
InChI Key InChIKey=KYDXLYCZFCDKCN-UHFFFAOYSA-N
Data  1 IC50
  Tab Delimited (TSV)   2D SDfile   Computed 3D by Vconf -m prep SDfile
Find this compound or compounds like it in BindingDB:
Activity Spreadsheet -- Enzyme Inhibition Constant Data from BindingDB
Found 1 hit for monomerid = 50191171
Target5-hydroxytryptamine receptor 2B(Homo sapiens (Human))
Hopital Saint-Louis
Curated by ChEMBL
LigandPNGBDBM50191171(2-(4-flurophenyl)-1,10b-dihydro-benzo[e]pyrazolo[1...)
Affinity DataIC50:  1.80nM. Assay description: Activity at 5HT2B receptor expressed in CHO cell assessed as inhibition of alpha-methyl-5HT-stimulated calcium release
In DepthDetails ArticlePubMed