BDBM50191354 CHEMBL3934243
SMILES Cc1ncc2sc(nn12)C(=O)N1CCCC1c1ccc(Cl)cc1
InChI Key InChIKey=SAVNWXMDAMFANR-UHFFFAOYSA-N
Data  2 IC50
PDB links: 1 PDB ID matches this monomer.
  Tab Delimited (TSV)   2D SDfile   Computed 3D by Vconf -m prep SDfile
Find this compound or compounds like it in BindingDB:
Activity Spreadsheet -- Enzyme Inhibition Constant Data from BindingDB
Found 2 hits for monomerid = 50191354
TargetCyclin-C(Homo sapiens (Human))
Merck
Curated by ChEMBL
LigandPNGBDBM50191354(CHEMBL3934243)
Affinity DataIC50:  17nM. Assay description: Inhibition of Alexa647 tracer binding to full length recombinant human His-tagged CDK8/cyclin C expressed in Baculovirus expression system preincubat...
TargetCyclin-dependent kinase 8(Homo sapiens (Human))
Merck
Curated by ChEMBL
LigandPNGBDBM50191354(CHEMBL3934243)
Affinity DataIC50:  100nM. Assay description: Inhibition of CDK8 in human 7dF3 cells preincubated for 2 hrs followed by beta-oestradiol addition measured after 24 hrs by luciferase reporter gene ...