BDBM50191504 1-cyclohexyl-2-[4-(4,3'-dichlorobiphenyl-2-ylmethoxy)phenyl]-1H-benzimidazole-5-carboxylic acid::CHEMBL378284
SMILES OC(=O)c1ccc2n(C3CCCCC3)c(nc2c1)-c1ccc(OCc2cc(Cl)ccc2-c2cccc(Cl)c2)cc1
InChI Key InChIKey=NBCUIHSPCQSERV-UHFFFAOYSA-N
Data  3 IC50
  Tab Delimited (TSV)   2D SDfile   Computed 3D by Vconf -m prep SDfile
Find this compound or compounds like it in BindingDB:
Activity Spreadsheet -- Enzyme Inhibition Constant Data from BindingDB
Found 3 hits for monomerid = 50191504
TargetRNA-directed RNA polymerase(Hepatitis C virus)
Central Pharmaceutical Research Institute
Curated by ChEMBL
LigandPNGBDBM50191504(1-cyclohexyl-2-[4-(4,3'-dichlorobiphenyl-2-ylmetho...)
Affinity DataIC50:  480nM. Assay description: Inhibition of HCV 1b BK six His-tagged C-terminal truncated 544 amino acid NS5B RNA dependent RNA polymerase
In DepthDetails ArticlePubMed
TargetRNA-directed RNA polymerase(Hepatitis C virus genotype 1)TBA
LigandPNGBDBM50191504(1-cyclohexyl-2-[4-(4,3'-dichlorobiphenyl-2-ylmetho...)
Affinity DataIC50:  2.08E+6nM. Assay description: Inhibition of Hepatitis C virus genotype 1 NS5B polymerases lacking C-terminal 47 amino acid residues expressed in Escherichia coli after 60 min
In DepthDetails Article
TargetRNA-directed RNA polymerase(Hepatitis C virus genotype 1)TBA
LigandPNGBDBM50191504(1-cyclohexyl-2-[4-(4,3'-dichlorobiphenyl-2-ylmetho...)
Affinity DataIC50:  2.08E+6nM. Assay description: Inhibition of Hepatitis C virus genotype 1 NS5B polymerases lacking C-terminal 47 amino acid residues expressed in Escherichia coli after 60 min
In DepthDetails Article