BDBM50191507 2-[4-(4'-carbamoyl-4-chlorobiphenyl-2-ylmethoxy)phenyl]-1-cyclohexyl-1H-benzimidazole-5-carboxylic acid::CHEMBL377889
SMILES NC(=O)c1ccc(cc1)-c1ccc(Cl)cc1COc1ccc(cc1)-c1nc2cc(ccc2n1C1CCCCC1)C(O)=O
InChI Key InChIKey=FSCIOEAQSHSDMS-UHFFFAOYSA-N
Data  3 IC50
  Tab Delimited (TSV)   2D SDfile   Computed 3D by Vconf -m prep SDfile
Find this compound or compounds like it in BindingDB:
Activity Spreadsheet -- Enzyme Inhibition Constant Data from BindingDB
Found 3 hits for monomerid = 50191507
TargetRNA-directed RNA polymerase(Hepatitis C virus)
Central Pharmaceutical Research Institute
Curated by ChEMBL
LigandPNGBDBM50191507(2-[4-(4'-carbamoyl-4-chlorobiphenyl-2-ylmethoxy)ph...)
Affinity DataIC50:  69nM. Assay description: Inhibition of HCV 1b BK six His-tagged C-terminal truncated 544 amino acid NS5B RNA dependent RNA polymerase
In DepthDetails ArticlePubMed
TargetRNA-directed RNA polymerase(Hepatitis C virus genotype 1)TBA
LigandPNGBDBM50191507(2-[4-(4'-carbamoyl-4-chlorobiphenyl-2-ylmethoxy)ph...)
Affinity DataIC50:  1.45E+7nM. Assay description: Inhibition of Hepatitis C virus genotype 1 NS5B polymerases lacking C-terminal 47 amino acid residues expressed in Escherichia coli after 60 min
In DepthDetails Article
TargetRNA-directed RNA polymerase(Hepatitis C virus genotype 1)TBA
LigandPNGBDBM50191507(2-[4-(4'-carbamoyl-4-chlorobiphenyl-2-ylmethoxy)ph...)
Affinity DataIC50:  1.44E+7nM. Assay description: Inhibition of Hepatitis C virus genotype 1 NS5B polymerases lacking C-terminal 47 amino acid residues expressed in Escherichia coli after 60 min
In DepthDetails Article