BDBM50191538 2-[4-(4-acetylamino-4'-chlorobiphenyl-2-ylmethoxy)-2-fluorophenyl]-1-cyclohexyl-1H-benzimidazole-5-carboxylic acid::CHEMBL213695
SMILES CC(=O)Nc1ccc(c(COc2ccc(-c3nc4cc(ccc4n3C3CCCCC3)C(O)=O)c(F)c2)c1)-c1ccc(Cl)cc1
InChI Key InChIKey=DBAZAUWEDZAMHO-UHFFFAOYSA-N
Data  1 IC50
  Tab Delimited (TSV)   2D SDfile   Computed 3D by Vconf -m prep SDfile
Find this compound or compounds like it in BindingDB:
Activity Spreadsheet -- Enzyme Inhibition Constant Data from BindingDB
Found 1 hit for monomerid = 50191538
TargetRNA-directed RNA polymerase(Hepatitis C virus)
Central Pharmaceutical Research Institute
Curated by ChEMBL
LigandPNGBDBM50191538(2-[4-(4-acetylamino-4'-chlorobiphenyl-2-ylmethoxy)...)
Affinity DataIC50:  14nM. Assay description: Inhibition of HCV 1b BK six His-tagged C-terminal truncated 544 amino acid NS5B RNA dependent RNA polymerase
In DepthDetails ArticlePubMed