BDBM50192919 CHEMBL3905160
SMILES Cn1c(NCCc2ccc(cc2)-n2cccn2)nc2cc(Cl)ccc2c1=O
InChI Key InChIKey=KBYDZNVJPIRQHL-UHFFFAOYSA-N
Data  2 IC50
  Tab Delimited (TSV)   2D SDfile   Computed 3D by Vconf -m prep SDfile
Find this compound or compounds like it in BindingDB:
Activity Spreadsheet -- Enzyme Inhibition Constant Data from BindingDB
Found 2 hits for monomerid = 50192919
TargetCytochrome P450 3A4(Homo sapiens (Human))
Sanofi R & D
Curated by ChEMBL
LigandPNGBDBM50192919(CHEMBL3905160)
Affinity DataIC50:  8.30E+3nM. Assay description: Inhibition of CYP3A4 in human liver microsomes assessed as 6-beta-hydroxytestosterone metabolite formation using testosterone as substrate incubated ...
In DepthDetails ArticlePubMed
TargetCytochrome P450 3A4(Homo sapiens (Human))
Sanofi R & D
Curated by ChEMBL
LigandPNGBDBM50192919(CHEMBL3905160)
Affinity DataIC50:  2.70E+4nM. Assay description: Inhibition of CYP3A4 in human liver microsomes assessed as 1'-hydroxymidazolam metabolite formation using midazolam as substrate incubated for 10 min...
In DepthDetails ArticlePubMed