BDBM50195483 CHEMBL373547::N-adamantan-1-yl-4-amino-3,5-dichloro-N-methyl-benzamide
SMILES CN(C(=O)c1cc(Cl)c(N)c(Cl)c1)C12CC3CC(CC(C3)C1)C2
InChI Key InChIKey=YKQHBKKDQMAMNG-UHFFFAOYSA-N
Data  2 KI  3 IC50
  Tab Delimited (TSV)   2D SDfile   Computed 3D by Vconf -m prep SDfile
Find this compound or compounds like it in BindingDB:
Activity Spreadsheet -- Enzyme Inhibition Constant Data from BindingDB
Found 5 hits for monomerid = 50195483
Target11-beta-hydroxysteroid dehydrogenase 1(Rattus norvegicus (rat))
Abbott Laboratories
Curated by ChEMBL
LigandPNGBDBM50195483(CHEMBL373547 | N-adamantan-1-yl-4-amino-3,5-dichlo...)
Affinity DataKi:  6nM. Assay description: Inhibition of rat 11beta-HSD1
In DepthDetails ArticlePubMed
Target11-beta-hydroxysteroid dehydrogenase 1(Homo sapiens (Human))
Abbott Laboratories
Curated by ChEMBL
LigandPNGBDBM50195483(CHEMBL373547 | N-adamantan-1-yl-4-amino-3,5-dichlo...)
Affinity DataKi:  10nM. Assay description: Inhibition of human 11beta-HSD1 expressed in Escherichia coli by SPA
In DepthDetails ArticlePubMed
Target11-beta-hydroxysteroid dehydrogenase type 2(Homo sapiens (Human))
Abbott Laboratories
Curated by ChEMBL
LigandPNGBDBM50195483(CHEMBL373547 | N-adamantan-1-yl-4-amino-3,5-dichlo...)
Affinity DataIC50: >1.00E+4nM. Assay description: Inhibition of human 11beta-HSD2 by SPA
In DepthDetails ArticlePubMed
Target11-beta-hydroxysteroid dehydrogenase 1(Homo sapiens (Human))
Abbott Laboratories
Curated by ChEMBL
LigandPNGBDBM50195483(CHEMBL373547 | N-adamantan-1-yl-4-amino-3,5-dichlo...)
Affinity DataIC50:  100nM. Assay description: Inhibition of human 11beta-HSD1 expressed in HEK293 cells by fluorescence polarization immuno-assay
In DepthDetails ArticlePubMed
Target11-beta-hydroxysteroid dehydrogenase type 2(Rattus norvegicus)
Abbott Laboratories
Curated by ChEMBL
LigandPNGBDBM50195483(CHEMBL373547 | N-adamantan-1-yl-4-amino-3,5-dichlo...)
Affinity DataIC50: >1.00E+4nM. Assay description: Inhibition of rat 11beta-HSD2
In DepthDetails ArticlePubMed