BDBM50195502 CHEMBL221261::N-((1s,4s)-4-((cyclohexylmethyl)carbamoyl)cyclohexyl)-4-amino-3,5-dichloro-N-cyclopropylbenzamide
SMILES Nc1c(Cl)cc(cc1Cl)C(=O)N(C1CC1)[C@H]1CC[C@H](CC1)C(=O)NCC1CCCCC1
InChI Key InChIKey=OLMCJWZDIBDVMD-MAEOIBBWSA-N
Data  2 KI  3 IC50
  Tab Delimited (TSV)   2D SDfile   Computed 3D by Vconf -m prep SDfile
Find this compound or compounds like it in BindingDB:
Activity Spreadsheet -- Enzyme Inhibition Constant Data from BindingDB
Found 5 hits for monomerid = 50195502
Target11-beta-hydroxysteroid dehydrogenase 1(Homo sapiens (Human))
Abbott Laboratories
Curated by ChEMBL
LigandPNGBDBM50195502(CHEMBL221261 | N-((1s,4s)-4-((cyclohexylmethyl)car...)
Affinity DataKi:  20nM. Assay description: Inhibition of human 11beta-HSD1 expressed in Escherichia coli by SPA
In DepthDetails ArticlePubMed
Target11-beta-hydroxysteroid dehydrogenase 1(Rattus norvegicus (rat))
Abbott Laboratories
Curated by ChEMBL
LigandPNGBDBM50195502(CHEMBL221261 | N-((1s,4s)-4-((cyclohexylmethyl)car...)
Affinity DataKi:  68nM. Assay description: Inhibition of rat 11beta-HSD1
In DepthDetails ArticlePubMed
Target11-beta-hydroxysteroid dehydrogenase type 2(Homo sapiens (Human))
Abbott Laboratories
Curated by ChEMBL
LigandPNGBDBM50195502(CHEMBL221261 | N-((1s,4s)-4-((cyclohexylmethyl)car...)
Affinity DataIC50: >1.00E+4nM. Assay description: Inhibition of human 11beta-HSD2 by SPA
In DepthDetails ArticlePubMed
Target11-beta-hydroxysteroid dehydrogenase type 2(Rattus norvegicus)
Abbott Laboratories
Curated by ChEMBL
LigandPNGBDBM50195502(CHEMBL221261 | N-((1s,4s)-4-((cyclohexylmethyl)car...)
Affinity DataIC50: >1.00E+4nM. Assay description: Inhibition of rat 11beta-HSD2
In DepthDetails ArticlePubMed
Target11-beta-hydroxysteroid dehydrogenase 1(Homo sapiens (Human))
Abbott Laboratories
Curated by ChEMBL
LigandPNGBDBM50195502(CHEMBL221261 | N-((1s,4s)-4-((cyclohexylmethyl)car...)
Affinity DataIC50:  330nM. Assay description: Inhibition of human 11beta-HSD1 expressed in HEK293 cells by fluorescence polarization immuno-assay
In DepthDetails ArticlePubMed