BDBM50195608 CHEMBL217791::N-hydroxy-6-(3,4-dihydro-4-oxo-6-(1-phenylethyl)-2-pyrimidinylthio)hexanamide
SMILES CC(c1ccccc1)c1cc(=O)[nH]c(SCCCCCC(=O)NO)n1
InChI Key InChIKey=CEVGXFYJZODGGH-UHFFFAOYSA-N
Data  3 IC50
  Tab Delimited (TSV)   2D SDfile   Computed 3D by Vconf -m prep SDfile
Find this compound or compounds like it in BindingDB:
Activity Spreadsheet -- Enzyme Inhibition Constant Data from BindingDB
Found 3 hits for monomerid = 50195608
TargetHistone deacetylase 2b(Zea mays)
Sapienza University Of Rome
Curated by ChEMBL
LigandPNGBDBM50195608(CHEMBL217791 | N-hydroxy-6-(3,4-dihydro-4-oxo-6-(1...)
Affinity DataIC50:  9nM. Assay description: Inhibition of maize HD2
In DepthDetails ArticlePubMed
TargetHistone deacetylase 1(Mus musculus (Mouse))
Sapienza University Of Rome
Curated by ChEMBL
LigandPNGBDBM50195608(CHEMBL217791 | N-hydroxy-6-(3,4-dihydro-4-oxo-6-(1...)
Affinity DataIC50:  121nM. Assay description: Inhibition of mouse HDAC1
In DepthDetails ArticlePubMed
TargetHistone deacetylase(Zea mays)
Sapienza University Of Rome
Curated by ChEMBL
LigandPNGBDBM50195608(CHEMBL217791 | N-hydroxy-6-(3,4-dihydro-4-oxo-6-(1...)
Affinity DataIC50:  92nM. Assay description: Inhibition of maize HD1B
In DepthDetails ArticlePubMed