BDBM50195638 3beta-ol-23,24-bisnor-5-en-22-(butanoic acid) amide::CHEMBL437714
SMILES C[C@@H]([C@H]1CC[C@H]2C3CC=C4C[C@@H](O)CC[C@]4(C)[C@H]3CC[C@]12C)C(=O)NCCCC(O)=O
InChI Key InChIKey=XXBSRLZDUBIABE-KASIMYLCSA-N
Data  1 IC50
  Tab Delimited (TSV)   2D SDfile   Computed 3D by Vconf -m prep SDfile
Find this compound or compounds like it in BindingDB:
Activity Spreadsheet -- Enzyme Inhibition Constant Data from BindingDB
Found 1 hit for monomerid = 50195638
TargetCycloartenol-C-24-methyltransferase(Arabidopsis thaliana)
Cardiff University
Curated by ChEMBL
LigandPNGBDBM50195638(3beta-ol-23,24-bisnor-5-en-22-(butanoic acid) amid...)
Affinity DataIC50: >1.00E+5nM. Assay description: Inhibition of Leishmania major recombinant 24-SMT
In DepthDetails ArticlePubMed