BDBM50195694 CHEMBL3976876
SMILES COc1cc(cc(OC)c1C)C(=O)N(CCCc1ccccc1)Cc1ccc(Oc2cc(Cl)ccc2C(O)=O)cc1
InChI Key InChIKey=JJDQTKSAYYDOHU-UHFFFAOYSA-N
Data  1 IC50
  Tab Delimited (TSV)   2D SDfile   Computed 3D by Vconf -m prep SDfile
Find this compound or compounds like it in BindingDB:
Activity Spreadsheet -- Enzyme Inhibition Constant Data from BindingDB
Found 1 hit for monomerid = 50195694
TargetLysophosphatidic acid receptor 1(Homo sapiens (Human))
Ono Pharmaceutical
Curated by ChEMBL
LigandPNGBDBM50195694(CHEMBL3976876)
Affinity DataIC50:  5.90nM. Assay description: Antagonist activity at human LPA1 receptor expressed in CHO cells assessed as reduction in LPA-induced intracellular Ca2+ concentration pretreated wi...
In DepthDetails ArticlePubMed