BDBM50195789 CHEMBL3967375
SMILES OC(=O)c1cccc(c1)-c1nccs1
InChI Key InChIKey=BLFSSABBFANDKK-UHFFFAOYSA-N
Data  1 IC50  1 Kd
PDB links: 1 PDB ID matches this monomer.
  Tab Delimited (TSV)   2D SDfile   Computed 3D by Vconf -m prep SDfile
Find this compound or compounds like it in BindingDB:
Activity Spreadsheet -- Enzyme Inhibition Constant Data from BindingDB
Found 2 hits for monomerid = 50195789
TargetBeta-lactamase(Klebsiella pneumoniae)
Uit The Arctic University Of Norway
Curated by ChEMBL
LigandPNGBDBM50195789(CHEMBL3967375)
Affinity DataIC50:  2.50E+5nM. Assay description: Inhibition of native signal containing Klebsiella pneumoniae OXA-48 using nitrocefin substrate pre-incubated for 5 mins before substrate addition
TargetBeta-lactamase(Klebsiella pneumoniae)
Uit The Arctic University Of Norway
Curated by ChEMBL
LigandPNGBDBM50195789(CHEMBL3967375)
Affinity DataKd:  3.10E+5nM. Assay description: Binding affinity to native signal deficient and TEV cleavage site containing His-tagged Klebsiella pneumoniae OXA-48 expressed in Escherichia coli as...