BDBM50197301 CHEMBL3922662::ebselen derivative 1d
SMILES Oc1ccccc1-n1[se]c2ccccc2c1=O
InChI Key InChIKey=RETMDRSAJYWULY-UHFFFAOYSA-N
Data  4 IC50
  Tab Delimited (TSV)   2D SDfile   Computed 3D by Vconf -m prep SDfile
Find this compound or compounds like it in BindingDB:
Activity Spreadsheet -- Enzyme Inhibition Constant Data from BindingDB
Found 4 hits for monomerid = 50197301
TargetMicrotubule-associated protein 2(Homo sapiens (Human))
Wroclaw University Of Technology
Curated by ChEMBL
LigandPNGBDBM50197301(CHEMBL3922662 | ebselen derivative 1d)
Affinity DataIC50:  1.02E+4nM. Assay description: Non-covalent/mixed type inhibition of recombinant human MetAP2 using Met-AMC as substrate preincubated for 30 mins followed by substrate addition by ...
In DepthDetails ArticlePubMed
TargetReplicase polyprotein 1ab(2019-nCoV)
The State University Of New Jersey
Curated by ChEMBL
LigandPNGBDBM50197301(CHEMBL3922662 | ebselen derivative 1d)
Affinity DataIC50:  236nM. Assay description: Inhibition of SARS-CoV-2 papain-like protease preincubated for 60 mins
In DepthDetails ArticlePubMed
TargetReplicase polyprotein 1ab(2019-nCoV)
The State University Of New Jersey
Curated by ChEMBL
LigandPNGBDBM50197301(CHEMBL3922662 | ebselen derivative 1d)
Affinity DataIC50:  240nM. Assay description: Inhibition of recombinant SARS CoV-2 PL protease incubated for 60 mins by fluorescence based analysis
In DepthDetails PubMed
TargetReplicase polyprotein 1ab(2019-nCoV)
The State University Of New Jersey
Curated by ChEMBL
LigandPNGBDBM50197301(CHEMBL3922662 | ebselen derivative 1d)
Affinity DataIC50:  236nM. Assay description: The inhibitor was screened against recombinant PL​pro​SARS and PL​pro​CoV2 at 37°Cin the assay buffer as described above. For...
In DepthDetails