BDBM50197417 2-(4-chloro-2-fluoro-phenoxy)-N-(5-methanesulfonyl-adamantan-2-yl)-2-methyl-propionamide::CHEMBL241717
SMILES CC(C)(Oc1ccc(Cl)cc1F)C(=O)N[C@H]1C2CC3CC1C[C@](C3)(C2)S(C)(=O)=O
InChI Key InChIKey=AGGRAAZXMDOZHP-RXAJHBGNSA-N
Data  2 KI  3 IC50
  Tab Delimited (TSV)   2D SDfile   Computed 3D by Vconf -m prep SDfile
Find this compound or compounds like it in BindingDB:
Activity Spreadsheet -- Enzyme Inhibition Constant Data from BindingDB
Found 5 hits for monomerid = 50197417
Target11-beta-hydroxysteroid dehydrogenase 1(Mus musculus (mouse))
Abbott Laboratories
Curated by ChEMBL
LigandPNGBDBM50197417(2-(4-chloro-2-fluoro-phenoxy)-N-(5-methanesulfonyl...)
Affinity DataKi:  8nM. Assay description: Inhibition of mouse HSD1 assessed as interconversion of cortisone to cortisol
In DepthDetails ArticlePubMed
Target11-beta-hydroxysteroid dehydrogenase 1(Homo sapiens (Human))
Abbott Laboratories
Curated by ChEMBL
LigandPNGBDBM50197417(2-(4-chloro-2-fluoro-phenoxy)-N-(5-methanesulfonyl...)
Affinity DataKi:  11nM. Assay description: Inhibition of human HSD1 assessed as interconversion of cortisone to cortisol
In DepthDetails ArticlePubMed
Target11-beta-hydroxysteroid dehydrogenase type 2(Homo sapiens (Human))
Abbott Laboratories
Curated by ChEMBL
LigandPNGBDBM50197417(2-(4-chloro-2-fluoro-phenoxy)-N-(5-methanesulfonyl...)
Affinity DataIC50:  2.10E+4nM. Assay description: Inhibition of human HSD2 assessed as interconversion of cortisone to cortisol
In DepthDetails ArticlePubMed
Target11-beta-hydroxysteroid dehydrogenase type 2(Mus musculus (mouse))
Abbott Laboratories
Curated by ChEMBL
LigandPNGBDBM50197417(2-(4-chloro-2-fluoro-phenoxy)-N-(5-methanesulfonyl...)
Affinity DataIC50: >1.00E+5nM. Assay description: Inhibition of mouse HSD2 assessed as interconversion of cortisone to cortisol
In DepthDetails ArticlePubMed
Target11-beta-hydroxysteroid dehydrogenase 1(Homo sapiens (Human))
Abbott Laboratories
Curated by ChEMBL
LigandPNGBDBM50197417(2-(4-chloro-2-fluoro-phenoxy)-N-(5-methanesulfonyl...)
Affinity DataIC50:  210nM. Assay description: Inhibition of human HSD1 expressed in HEK cells
In DepthDetails ArticlePubMed