BDBM50197825 CHEMBL1928057
SMILES Oc1cccc(c1)C(=O)c1cccc(n1)-c1ccc(O)c(F)c1
InChI Key InChIKey=APAAQEJITASAPV-UHFFFAOYSA-N
Data  1 KI
  Tab Delimited (TSV)   2D SDfile   Computed 3D by Vconf -m prep SDfile
Find this compound or compounds like it in BindingDB:
Activity Spreadsheet -- Enzyme Inhibition Constant Data from BindingDB
Found 1 hit for monomerid = 50197825
Target17-beta-hydroxysteroid dehydrogenase 14(Homo sapiens (Human))
Philipps University Marburg
Curated by ChEMBL
LigandPNGBDBM50197825(CHEMBL1928057)
Affinity DataKi:  467nM. Assay description: Inhibition of N-terminal 6His-tagged human human HSD17B14 expressed in Escherichia coli BL21 (DE3) pLysS using E2 substrate and NAD+ incubated for 2 ...
In DepthDetails ArticlePubMed