BDBM50198 (2Z)-2-(2-bromo-4-hydroxy-5-methoxy-benzylidene)-4-nitro-indane-1,3-quinone::(2Z)-2-[(2-bromanyl-5-methoxy-4-oxidanyl-phenyl)methylidene]-4-nitro-indene-1,3-dione::(2Z)-2-[(2-bromo-4-hydroxy-5-methoxyphenyl)methylidene]-4-nitroindene-1,3-dione::2-(2-bromo-4-hydroxy-5-methoxybenzylidene)-4-nitro-1H-indene-1,3(2H)-dione::MLS000577990::SMR000198393::cid_1308940
SMILES COc1cc(\C=C2\C(=O)c3cccc(c3C2=O)[N+]([O-])=O)c(Br)cc1O
InChI Key InChIKey=UIRXGDDZXKKMKG-YHYXMXQVSA-N
Data  3 IC50
  Tab Delimited (TSV)   2D SDfile   Computed 3D by Vconf -m prep SDfile
Find this compound or compounds like it in BindingDB:
Activity Spreadsheet -- Enzyme Inhibition Constant Data from BindingDB
Found 3 hits for monomerid = 50198
TargetInduced myeloid leukemia cell differentiation protein Mcl-1(Homo sapiens (Human))
Emory University
Curated by PubChem BioAssay
LigandPNGBDBM50198((2Z)-2-(2-bromo-4-hydroxy-5-methoxy-benzylidene)-4...)
Affinity DataIC50:  1.39E+3nM. Assay description: NIH Molecular Libraries Screening Centers Network [MLSCN] Emory Chemical Biology Discovery Center in MLSCN Assay provider: Nikolovska-Coleska, Univer...
In DepthDetails PCBioAssay
TargetM1 family aminopeptidase(Plasmodium falciparum (isolate FcB1 / Columbia))
Srmlsc
Curated by PubChem BioAssay
LigandPNGBDBM50198((2Z)-2-(2-bromo-4-hydroxy-5-methoxy-benzylidene)-4...)
Affinity DataIC50:  5.94E+3nM. Assay description: Southern Research Molecular Libraries Screening Center (SRMLSC) Southern Research Institute (Birmingham, Alabama) NIH Molecular Libraries Screening...
In DepthDetails PCBioAssay
TargetGlycoprotein 42(Human herpesvirus 4 type 2)
Emory University
Curated by PubChem BioAssay
LigandPNGBDBM50198((2Z)-2-(2-bromo-4-hydroxy-5-methoxy-benzylidene)-4...)
Affinity DataIC50:  3.82E+3nM. Assay description: NIH Molecular Libraries Screening Centers Network [MLSCN] Emory Chemical Biology Discovery Center in MLSCN Assay provider: Theodore Jardetzky; Northw...
In DepthDetails PCBioAssay