BDBM50198888 CHEMBL3967845
SMILES Oc1c(Br)cc(\C=C2/SC(=O)NC2=O)cc1Br
InChI Key InChIKey=MFIRMNDQUFKHHE-CLTKARDFSA-N
Data  1 KI  1 IC50
  Tab Delimited (TSV)   2D SDfile   Computed 3D by Vconf -m prep SDfile
Find this compound or compounds like it in BindingDB:
Activity Spreadsheet -- Enzyme Inhibition Constant Data from BindingDB
Found 2 hits for monomerid = 50198888
TargetCDGSH iron-sulfur domain-containing protein 1(Homo sapiens (Human))
West Virginia University
Curated by ChEMBL
LigandPNGBDBM50198888(CHEMBL3967845)
Affinity DataKi:  141nM. Assay description: Displacement of [3H]rosiglitazone from recombinant human C-terminal His-tagged MitoNEET cytosolic domain (32 to 108 residues) expressed in Escherichi...
In DepthDetails ArticlePubMed
TargetCDGSH iron-sulfur domain-containing protein 1(Homo sapiens (Human))
West Virginia University
Curated by ChEMBL
LigandPNGBDBM50198888(CHEMBL3967845)
Affinity DataIC50:  3.29E+3nM. Assay description: Displacement of [3H]rosiglitazone from recombinant human C-terminal His-tagged MitoNEET cytosolic domain (32 to 108 residues) expressed in Escherichi...
In DepthDetails ArticlePubMed