BDBM50199777 3-(2-methyl-4-((R)-3-(2-(pyridin-2-yl)-4-(trifluoromethyl)phenoxy)butoxy)phenyl)propanoic acid::CHEMBL241478
SMILES C[C@H](CCOc1ccc(CCC(O)=O)c(C)c1)Oc1ccc(cc1-c1ccccn1)C(F)(F)F
InChI Key InChIKey=AIUXBXGPPYWHFP-GOSISDBHSA-N
Data  6 IC50  3 EC50
  Tab Delimited (TSV)   2D SDfile   Computed 3D by Vconf -m prep SDfile
Find this compound or compounds like it in BindingDB:
Activity Spreadsheet -- Enzyme Inhibition Constant Data from BindingDB
Found 9 hits for monomerid = 50199777
TargetPeroxisome proliferator-activated receptor alpha(Homo sapiens (Human))
Eli Lilly
Curated by ChEMBL
LigandPNGBDBM50199777(3-(2-methyl-4-((R)-3-(2-(pyridin-2-yl)-4-(trifluor...)
Affinity DataIC50:  5.88E+3nM. Assay description: Displacement of [3H]2-(4-{2-[3-(2,4-difluoro-phenyl)-1-heptyl-ureido]-ethyl}-phenoxy)-2-methyl butyric acid from human PPARalpha
In DepthDetails ArticlePubMed
TargetPeroxisome proliferator-activated receptor delta(Homo sapiens (Human))
Eli Lilly
Curated by ChEMBL
LigandPNGBDBM50199777(3-(2-methyl-4-((R)-3-(2-(pyridin-2-yl)-4-(trifluor...)
Affinity DataIC50:  4nM. Assay description: Displacement of [3H]2-(4-{2-[3-(2,4-difluoro-phenyl)-1-heptyl-ureido]-ethyl}-phenoxy)-2-methyl butyric acid from human PPARdelta
In DepthDetails ArticlePubMed
TargetPeroxisome proliferator-activated receptor delta(Homo sapiens (Human))
Eli Lilly
Curated by ChEMBL
LigandPNGBDBM50199777(3-(2-methyl-4-((R)-3-(2-(pyridin-2-yl)-4-(trifluor...)
Affinity DataEC50:  6nM. Assay description: Agonist activity at human Gal4-PPARdelta expressed in CV1 cells by transactivation assay
In DepthDetails ArticlePubMed
TargetPeroxisome proliferator-activated receptor gamma(Homo sapiens (Human))
Eli Lilly
Curated by ChEMBL
LigandPNGBDBM50199777(3-(2-methyl-4-((R)-3-(2-(pyridin-2-yl)-4-(trifluor...)
Affinity DataIC50:  20nM. Assay description: Displacement of [3H]2-methyl-2-(4-{3-[porpyl-(5-pyridin-2yl-thiophene-2-sulfonyl)-amino]-propyl}-phenoxy)-propionic acid from human PPARgamma
In DepthDetails ArticlePubMed
TargetPeroxisome proliferator-activated receptor alpha(Homo sapiens (Human))
Eli Lilly
Curated by ChEMBL
LigandPNGBDBM50199777(3-(2-methyl-4-((R)-3-(2-(pyridin-2-yl)-4-(trifluor...)
Affinity DataIC50:  5.87E+3nM. Assay description: Agonist activity at PPARalpha
In DepthDetails ArticlePubMed
TargetPeroxisome proliferator-activated receptor alpha(Homo sapiens (Human))
Eli Lilly
Curated by ChEMBL
LigandPNGBDBM50199777(3-(2-methyl-4-((R)-3-(2-(pyridin-2-yl)-4-(trifluor...)
Affinity DataEC50:  2.34E+3nM. Assay description: Agonist activity at human Gal4-PPARalpha expressed in CV1 cells by transactivation assay
In DepthDetails ArticlePubMed
TargetPeroxisome proliferator-activated receptor gamma(Homo sapiens (Human))
Eli Lilly
Curated by ChEMBL
LigandPNGBDBM50199777(3-(2-methyl-4-((R)-3-(2-(pyridin-2-yl)-4-(trifluor...)
Affinity DataIC50:  20nM. Assay description: Agonist activity at PPARgamma
In DepthDetails ArticlePubMed
TargetPeroxisome proliferator-activated receptor delta(Homo sapiens (Human))
Eli Lilly
Curated by ChEMBL
LigandPNGBDBM50199777(3-(2-methyl-4-((R)-3-(2-(pyridin-2-yl)-4-(trifluor...)
Affinity DataIC50:  4nM. Assay description: Agonist activity at PPARdelta
In DepthDetails ArticlePubMed
TargetPeroxisome proliferator-activated receptor gamma(Homo sapiens (Human))
Eli Lilly
Curated by ChEMBL
LigandPNGBDBM50199777(3-(2-methyl-4-((R)-3-(2-(pyridin-2-yl)-4-(trifluor...)
Affinity DataEC50:  67nM. Assay description: Agonist activity at PPARgamma in CV1 cells by transactivation assay
In DepthDetails ArticlePubMed