BDBM50199984 CHEMBL218378::N6-(5-chloro-2-methoxybenzyl)-2-(4-cyclopentylmethyl-1,2,3-triazol-1-yl)-9-(beta-D-ribofuranosyl)adenine
SMILES COc1ccc(Cl)c(CNc2nc(nc3n(cnc23)[C@@H]2O[C@H](CO)[C@@H](O)[C@H]2O)-n2cc(CC3CCCC3)nn2)c1
InChI Key InChIKey=FSJVLFODYBZABL-PTGPVQHPSA-N
Data  3 KI
  Tab Delimited (TSV)   2D SDfile   Computed 3D by Vconf -m prep SDfile
Find this compound or compounds like it in BindingDB:
Activity Spreadsheet -- Enzyme Inhibition Constant Data from BindingDB
Found 3 hits for monomerid = 50199984
TargetAdenosine receptor A3(Homo sapiens (Human))
Ghent University
Curated by ChEMBL
LigandPNGBDBM50199984(CHEMBL218378 | N6-(5-chloro-2-methoxybenzyl)-2-(4-...)
Affinity DataKi:  18nM. Assay description: Displacement of [125I]AB-MECA from human Adenosine A3 receptor expressed in CHO cells
In DepthDetails ArticlePubMed
TargetAdenosine receptor A1(Homo sapiens (Human))
Ghent University
Curated by ChEMBL
LigandPNGBDBM50199984(CHEMBL218378 | N6-(5-chloro-2-methoxybenzyl)-2-(4-...)
Affinity DataKi:  830nM. Assay description: Displacement of [3H]CCPA from human Adenosine A1 receptor expressed in CHO cells
In DepthDetails ArticlePubMed
TargetAdenosine receptor A2a(Homo sapiens (Human))
Ghent University
Curated by ChEMBL
LigandPNGBDBM50199984(CHEMBL218378 | N6-(5-chloro-2-methoxybenzyl)-2-(4-...)
Affinity DataKi:  6.00E+3nM. Assay description: Displacement of [3H]CGS21680 from human Adenosine A2A receptor expressed in CHO cells
In DepthDetails ArticlePubMed