BDBM50201 (E)-3-(2-furanyl)-N-[(4-sulfamoylanilino)-sulfanylidenemethyl]-2-propenamide::(E)-3-(2-furyl)-N-[(4-sulfamoylphenyl)thiocarbamoyl]acrylamide::(E)-3-(furan-2-yl)-N-[(4-sulfamoylphenyl)carbamothioyl]prop-2-enamide::4-[3-(3-Furan-2-yl-acryloyl)-thioureido]-benzenesulfonamide::MLS000555105::SMR000171435::cid_1974778
SMILES NS(=O)(=O)c1ccc(NC(=S)NC(=O)C=Cc2ccco2)cc1
InChI Key InChIKey=WVQODCPXOCIDGU-UHFFFAOYSA-N
Data  6 IC50  1 EC50
  Tab Delimited (TSV)   2D SDfile   Computed 3D by Vconf -m prep SDfile
Find this compound or compounds like it in BindingDB:
Activity Spreadsheet -- Enzyme Inhibition Constant Data from BindingDB
Found 7 hits for monomerid = 50201
TargetInduced myeloid leukemia cell differentiation protein Mcl-1(Homo sapiens (Human))
Emory University
Curated by PubChem BioAssay
LigandPNGBDBM50201((E)-3-(2-furanyl)-N-[(4-sulfamoylanilino)-sulfanyl...)
Affinity DataIC50:  6.46E+3nM. Assay description: NIH Molecular Libraries Screening Centers Network [MLSCN] Emory Chemical Biology Discovery Center in MLSCN Assay provider: Nikolovska-Coleska, Univer...
In DepthDetails PCBioAssay
TargetIntestinal-type alkaline phosphatase(Homo sapiens (Human))
Burnham Center For Chemical Genomics
Curated by PubChem BioAssay
LigandPNGBDBM50201((E)-3-(2-furanyl)-N-[(4-sulfamoylanilino)-sulfanyl...)
Affinity DataIC50:  8.09E+3nM. Assay description: Data Source: Sanford-Burnham Center for Chemical Genomics (SBCCG) Source Affiliation: Sanford-Burnham Medical Research Institute(SBMRI, San Diego, CA...
In DepthDetails PCBioAssay
TargetAlkaline phosphatase, germ cell type(Homo sapiens (Human))
Burnham Center For Chemical Genomics
Curated by PubChem BioAssay
LigandPNGBDBM50201((E)-3-(2-furanyl)-N-[(4-sulfamoylanilino)-sulfanyl...)
Affinity DataEC50: >1.00E+5nM. Assay description: Data Source: Sanford-Burnham Center for Chemical Genomics (SBCCG) Source Affiliation: Sanford-Burnham Medical Research Institute (SBMRI, San Diego, C...
In DepthDetails PCBioAssay
TargetPC4 and SFRS1-interacting protein(Homo sapiens (Human))
The Scripps Research Institute Molecular Screening Center
Curated by PubChem BioAssay
LigandPNGBDBM50201((E)-3-(2-furanyl)-N-[(4-sulfamoylanilino)-sulfanyl...)
Affinity DataIC50:  3.65E+4nM. Assay description: Source (MLPCN Center Name): The Scripps Research Institute Molecular Screening Center (SRIMSC) Affiliation: Ohio State University Assay Provider: Mam...
In DepthDetails PCBioAssay
TargetIntestinal-type alkaline phosphatase 1(Rattus norvegicus (Rat))
Burnham Center For Chemical Genomics
Curated by PubChem BioAssay
LigandPNGBDBM50201((E)-3-(2-furanyl)-N-[(4-sulfamoylanilino)-sulfanyl...)
Affinity DataIC50:  1.87E+3nM. Assay description: Data Source: Sanford-Burnham Center for Chemical Genomics (SBCCG) Source Affiliation: Sanford-Burnham Medical Research Institute (SBMRI, San Diego, C...
In DepthDetails PCBioAssay
TargetPC4 and SFRS1-interacting protein(Homo sapiens (Human))
The Scripps Research Institute Molecular Screening Center
Curated by PubChem BioAssay
LigandPNGBDBM50201((E)-3-(2-furanyl)-N-[(4-sulfamoylanilino)-sulfanyl...)
Affinity DataIC50:  5.37E+4nM. Assay description: Source (MLPCN Center Name): The Scripps Research Institute Molecular Screening Center (SRIMSC) Affiliation: Ohio State University Assay Provider: Mam...
In DepthDetails PCBioAssay
TargetAlkaline phosphatase, tissue-nonspecific isozyme(Homo sapiens (Human))
Burnham Center For Chemical Genomics
Curated by PubChem BioAssay
LigandPNGBDBM50201((E)-3-(2-furanyl)-N-[(4-sulfamoylanilino)-sulfanyl...)
Affinity DataIC50: >1.00E+5nM. Assay description: Data Source: Sanford-Burnham Center for Chemical Genomics (SBCCG) Source Affiliation: Sanford-Burnham Medical Research Institute (SBMRI, San Diego, C...
In DepthDetails PCBioAssay