BDBM50201701 CHEMBL390474::cis-4-(2,3-dimethylphenoxy)-6-oxa-1-aza-bicyclo[3.2.1]octan-7-one
SMILES Cc1cccc(O[C@H]2CCN3C[C@H]2OC3=O)c1C
InChI Key InChIKey=SIIJWJNEODXHNY-QWHCGFSZSA-N
Data  9 IC50
  Tab Delimited (TSV)   2D SDfile   Computed 3D by Vconf -m prep SDfile
Find this compound or compounds like it in BindingDB:
Activity Spreadsheet -- Enzyme Inhibition Constant Data from BindingDB
Found 9 hits for monomerid = 50201701
TargetDipeptidyl peptidase 1(Homo sapiens (Human))
The Genomics Institute Of The Novartis Research Foundation
Curated by ChEMBL
LigandPNGBDBM50201701(CHEMBL390474 | cis-4-(2,3-dimethylphenoxy)-6-oxa-1...)
Affinity DataIC50:  18nM. Assay description: Inhibition of human recombinant cathepsin C
In DepthDetails ArticlePubMed
TargetPro-cathepsin H(Homo sapiens (Human))
The Genomics Institute Of The Novartis Research Foundation
Curated by ChEMBL
LigandPNGBDBM50201701(CHEMBL390474 | cis-4-(2,3-dimethylphenoxy)-6-oxa-1...)
Affinity DataIC50:  2.65E+3nM. Assay description: Inhibition of human recombinant cathepsin H
In DepthDetails ArticlePubMed
TargetCathepsin K(Homo sapiens (Human))
The Genomics Institute Of The Novartis Research Foundation
Curated by ChEMBL
LigandPNGBDBM50201701(CHEMBL390474 | cis-4-(2,3-dimethylphenoxy)-6-oxa-1...)
Affinity DataIC50:  197nM. Assay description: Inhibition of human recombinant cathepsin X
In DepthDetails ArticlePubMed
TargetProcathepsin L(Homo sapiens (Human))
The Genomics Institute Of The Novartis Research Foundation
Curated by ChEMBL
LigandPNGBDBM50201701(CHEMBL390474 | cis-4-(2,3-dimethylphenoxy)-6-oxa-1...)
Affinity DataIC50:  22nM. Assay description: Inhibition of human recombinant cathepsin L
In DepthDetails ArticlePubMed
TargetCathepsin F(Homo sapiens (Human))
The Genomics Institute Of The Novartis Research Foundation
Curated by ChEMBL
LigandPNGBDBM50201701(CHEMBL390474 | cis-4-(2,3-dimethylphenoxy)-6-oxa-1...)
Affinity DataIC50:  331nM. Assay description: Inhibition of human recombinant cathepsin F
In DepthDetails ArticlePubMed
TargetCathepsin S(Homo sapiens (Human))
The Genomics Institute Of The Novartis Research Foundation
Curated by ChEMBL
LigandPNGBDBM50201701(CHEMBL390474 | cis-4-(2,3-dimethylphenoxy)-6-oxa-1...)
Affinity DataIC50:  16nM. Assay description: Inhibition of human recombinant cathepsin S
In DepthDetails ArticlePubMed
TargetCathepsin K(Homo sapiens (Human))
The Genomics Institute Of The Novartis Research Foundation
Curated by ChEMBL
LigandPNGBDBM50201701(CHEMBL390474 | cis-4-(2,3-dimethylphenoxy)-6-oxa-1...)
Affinity DataIC50:  38nM. Assay description: Inhibition of human recombinant cathepsin K
In DepthDetails ArticlePubMed
TargetCathepsin B(Homo sapiens (Human))
The Genomics Institute Of The Novartis Research Foundation
Curated by ChEMBL
LigandPNGBDBM50201701(CHEMBL390474 | cis-4-(2,3-dimethylphenoxy)-6-oxa-1...)
Affinity DataIC50:  1nM. Assay description: Inhibition of human recombinant cathepsin B
In DepthDetails ArticlePubMed
TargetCathepsin L2(Homo sapiens (Human))
The Genomics Institute Of The Novartis Research Foundation
Curated by ChEMBL
LigandPNGBDBM50201701(CHEMBL390474 | cis-4-(2,3-dimethylphenoxy)-6-oxa-1...)
Affinity DataIC50:  131nM. Assay description: Inhibition of human recombinant cathepsin V
In DepthDetails ArticlePubMed