BDBM50201805 CHEMBL3903987
SMILES CCOC(=O)c1c(C)[nH]c(\C=C2/S\C(=N/c3ccccc3)N(C2=O)c2ccccc2)c1C
InChI Key InChIKey=JJXQQVDGVYWXJQ-USZFSVTMSA-N
Data  2 IC50
  Tab Delimited (TSV)   2D SDfile   Computed 3D by Vconf -m prep SDfile
Find this compound or compounds like it in BindingDB:
Activity Spreadsheet -- Enzyme Inhibition Constant Data from BindingDB
Found 2 hits for monomerid = 50201805
TargetM-phase inducer phosphatase 2(Homo sapiens (Human))
Xi'An Jiaotong University
Curated by ChEMBL
LigandPNGBDBM50201805(CHEMBL3903987)
Affinity DataIC50:  1.66E+6nM. Assay description: Inhibition of human recombinant GST-tagged CDC25B assessed as reduction in dephosphorylation of florigenic phosphatase substrate preincubated for 1 h...
In DepthDetails ArticlePubMed
TargetTyrosine-protein phosphatase non-receptor type 1(Homo sapiens (Human))
Xi'An Jiaotong University
Curated by ChEMBL
LigandPNGBDBM50201805(CHEMBL3903987)
Affinity DataIC50:  8.66E+6nM. Assay description: Inhibition of human recombinant GST-tagged PTP1B catalytic domain expressed in Escherichia coli BL21-Conden plus (DE3) using pNPP as substrate
In DepthDetails ArticlePubMed