BDBM50202394 (RR/SS)-2-[1-(4-chlorophenyl)hexyl]piperidine::(RS/SR)-2-[1-(4-chlorophenyl)hexyl]piperidine::CHEMBL219703
SMILES CCCCCC(C1CCCCN1)c1ccc(Cl)cc1
InChI Key InChIKey=PAZWPXLTYQROKI-UHFFFAOYSA-N
Data  6 KI  6 IC50
  Tab Delimited (TSV)   2D SDfile   Computed 3D by Vconf -m prep SDfile
Find this compound or compounds like it in BindingDB:
Activity Spreadsheet -- Enzyme Inhibition Constant Data from BindingDB
Found 12 hits for monomerid = 50202394
TargetSodium-dependent dopamine transporter(Homo sapiens (Human))
Massachusetts College Of Pharmacy And Health Sciences
Curated by ChEMBL
LigandPNGBDBM50202394((RR/SS)-2-[1-(4-chlorophenyl)hexyl]piperidine | (R...)
Affinity DataKi:  23nM. Assay description: Displacement of [125I]RTI-55 from human DAT expressing HEK293 cells
In DepthDetails ArticlePubMed
TargetSodium-dependent dopamine transporter(Homo sapiens (Human))
Massachusetts College Of Pharmacy And Health Sciences
Curated by ChEMBL
LigandPNGBDBM50202394((RR/SS)-2-[1-(4-chlorophenyl)hexyl]piperidine | (R...)
Affinity DataKi:  23nM. Assay description: Displacement of [125I]RTI-55 from human DAT expressing HEK293 cells
In DepthDetails ArticlePubMed
TargetSodium-dependent noradrenaline transporter(Homo sapiens (Human))
Massachusetts College Of Pharmacy And Health Sciences
Curated by ChEMBL
LigandPNGBDBM50202394((RR/SS)-2-[1-(4-chlorophenyl)hexyl]piperidine | (R...)
Affinity DataKi:  160nM. Assay description: Displacement of [125I]RTI-55 from human NET expressing HEK293 cells
In DepthDetails ArticlePubMed
TargetSodium-dependent noradrenaline transporter(Homo sapiens (Human))
Massachusetts College Of Pharmacy And Health Sciences
Curated by ChEMBL
LigandPNGBDBM50202394((RR/SS)-2-[1-(4-chlorophenyl)hexyl]piperidine | (R...)
Affinity DataKi:  160nM. Assay description: Displacement of [125I]RTI-55 from human NET expressing HEK293 cells
In DepthDetails ArticlePubMed
TargetSodium-dependent serotonin transporter(Homo sapiens (Human))
Massachusetts College Of Pharmacy And Health Sciences
Curated by ChEMBL
LigandPNGBDBM50202394((RR/SS)-2-[1-(4-chlorophenyl)hexyl]piperidine | (R...)
Affinity DataKi:  2.20E+3nM. Assay description: Displacement of [125I]RTI-55 from human SERT expressing HEK293 cells
In DepthDetails ArticlePubMed
TargetSodium-dependent serotonin transporter(Homo sapiens (Human))
Massachusetts College Of Pharmacy And Health Sciences
Curated by ChEMBL
LigandPNGBDBM50202394((RR/SS)-2-[1-(4-chlorophenyl)hexyl]piperidine | (R...)
Affinity DataKi:  2.20E+3nM. Assay description: Displacement of [125I]RTI-55 from human SERT expressing HEK293 cells
In DepthDetails ArticlePubMed
TargetSodium-dependent dopamine transporter(Homo sapiens (Human))
Massachusetts College Of Pharmacy And Health Sciences
Curated by ChEMBL
LigandPNGBDBM50202394((RR/SS)-2-[1-(4-chlorophenyl)hexyl]piperidine | (R...)
Affinity DataIC50:  45nM. Assay description: Inhibition of [3H]DA uptake at human DAT expressing HEK293 cells
In DepthDetails ArticlePubMed
TargetSodium-dependent dopamine transporter(Homo sapiens (Human))
Massachusetts College Of Pharmacy And Health Sciences
Curated by ChEMBL
LigandPNGBDBM50202394((RR/SS)-2-[1-(4-chlorophenyl)hexyl]piperidine | (R...)
Affinity DataIC50:  45nM. Assay description: Inhibition of [3H]DA uptake at human DAT expressing HEK293 cells
In DepthDetails ArticlePubMed
TargetSodium-dependent serotonin transporter(Homo sapiens (Human))
Massachusetts College Of Pharmacy And Health Sciences
Curated by ChEMBL
LigandPNGBDBM50202394((RR/SS)-2-[1-(4-chlorophenyl)hexyl]piperidine | (R...)
Affinity DataIC50:  1.50E+3nM. Assay description: Inhibition of [3H]5-HT uptake into human SERT expressing HEK293 cells
In DepthDetails ArticlePubMed
TargetSodium-dependent noradrenaline transporter(Homo sapiens (Human))
Massachusetts College Of Pharmacy And Health Sciences
Curated by ChEMBL
LigandPNGBDBM50202394((RR/SS)-2-[1-(4-chlorophenyl)hexyl]piperidine | (R...)
Affinity DataIC50:  49nM. Assay description: Inhibition of [3H]NE uptake into human NET expressing HEK293 cells
In DepthDetails ArticlePubMed
TargetSodium-dependent serotonin transporter(Homo sapiens (Human))
Massachusetts College Of Pharmacy And Health Sciences
Curated by ChEMBL
LigandPNGBDBM50202394((RR/SS)-2-[1-(4-chlorophenyl)hexyl]piperidine | (R...)
Affinity DataIC50:  1.50E+3nM. Assay description: Inhibition of [3H]5-HT uptake into human SERT expressing HEK293 cells
In DepthDetails ArticlePubMed
TargetSodium-dependent noradrenaline transporter(Homo sapiens (Human))
Massachusetts College Of Pharmacy And Health Sciences
Curated by ChEMBL
LigandPNGBDBM50202394((RR/SS)-2-[1-(4-chlorophenyl)hexyl]piperidine | (R...)
Affinity DataIC50:  49nM. Assay description: Inhibition of [3H]NE uptake into human NET expressing HEK293 cells
In DepthDetails ArticlePubMed