BDBM50203372 CHEMBL395632::naphthalene-1-carboxylic acid [1-(2-methyl-benzyl)-piperidin-4-yl]-amide
SMILES Cc1ccccc1CN1CCC(CC1)NC(=O)c1cccc2ccccc12
InChI Key InChIKey=QOWCJLPVORHIJU-UHFFFAOYSA-N
Data  1 KI
  Tab Delimited (TSV)   2D SDfile   Computed 3D by Vconf -m prep SDfile
Find this compound or compounds like it in BindingDB:
Activity Spreadsheet -- Enzyme Inhibition Constant Data from BindingDB
Found 1 hit for monomerid = 50203372
TargetD(4) dopamine receptor(Homo sapiens (Human))
Université
Curated by ChEMBL
LigandPNGBDBM50203372(CHEMBL395632 | naphthalene-1-carboxylic acid [1-(2...)
Affinity DataKi:  155nM. Assay description: Displacement of [3H]nemonapride from human cloned dopamine D4.2 receptor
In DepthDetails ArticlePubMed