BDBM50203377 CHEMBL234647::naphthalene-2-carboxylic acid [1-(2-methyl-benzyl)-piperidin-4-yl]-amide
SMILES Cc1ccccc1CN1CCC(CC1)NC(=O)c1ccc2ccccc2c1
InChI Key InChIKey=JIGJYOFQTSHTPK-UHFFFAOYSA-N
Data  2 KI
  Tab Delimited (TSV)   2D SDfile   Computed 3D by Vconf -m prep SDfile
Find this compound or compounds like it in BindingDB:
Activity Spreadsheet -- Enzyme Inhibition Constant Data from BindingDB
Found 2 hits for monomerid = 50203377
TargetD(4) dopamine receptor(Homo sapiens (Human))
Université
Curated by ChEMBL
LigandPNGBDBM50203377(CHEMBL234647 | naphthalene-2-carboxylic acid [1-(2...)
Affinity DataKi:  26nM. Assay description: Displacement of [3H]nemonapride from human cloned dopamine D4.2 receptor
In DepthDetails ArticlePubMed
Target5-hydroxytryptamine receptor 2A(Rattus norvegicus (rat))
Université
Curated by ChEMBL
LigandPNGBDBM50203377(CHEMBL234647 | naphthalene-2-carboxylic acid [1-(2...)
Affinity DataKi:  175nM. Assay description: Displacement of [3H]ketanserin from rat 5HT2A receptor
In DepthDetails ArticlePubMed