BDBM50203395 CHEMBL234644::N-(1-(4-nitrobenzyl)piperidin-4-yl)-2-naphthamide
SMILES [O-][N+](=O)c1ccc(CN2CCC(CC2)NC(=O)c2ccc3ccccc3c2)cc1
InChI Key InChIKey=BAYSOSKDAJWQFJ-UHFFFAOYSA-N
Data  2 KI
  Tab Delimited (TSV)   2D SDfile   Computed 3D by Vconf -m prep SDfile
Find this compound or compounds like it in BindingDB:
Activity Spreadsheet -- Enzyme Inhibition Constant Data from BindingDB
Found 2 hits for monomerid = 50203395
TargetD(4) dopamine receptor(Homo sapiens (Human))
Université
Curated by ChEMBL
LigandPNGBDBM50203395(CHEMBL234644 | N-(1-(4-nitrobenzyl)piperidin-4-yl)...)
Affinity DataKi:  181nM. Assay description: Displacement of [3H]nemonapride from human cloned dopamine D4.2 receptor
In DepthDetails ArticlePubMed
Target5-hydroxytryptamine receptor 2A(Rattus norvegicus (rat))
Université
Curated by ChEMBL
LigandPNGBDBM50203395(CHEMBL234644 | N-(1-(4-nitrobenzyl)piperidin-4-yl)...)
Affinity DataKi:  278nM. Assay description: Displacement of [3H]ketanserin from rat 5HT2A receptor
In DepthDetails ArticlePubMed