BDBM50203410 CHEMBL3901489
SMILES CCOc1ccc(NC(=O)Cn2cc(Cn3c(nc(c3-c3ccccc3)-c3ccccc3)-c3ccc(cc3)C(=O)OC)nn2)cc1
InChI Key InChIKey=DPTKQJRDUJBCQJ-UHFFFAOYSA-N
Data  2 IC50
  Tab Delimited (TSV)   2D SDfile   Computed 3D by Vconf -m prep SDfile
Find this compound or compounds like it in BindingDB:
Activity Spreadsheet -- Enzyme Inhibition Constant Data from BindingDB
Found 2 hits for monomerid = 50203410
TargetProbable maltase-glucoamylase 2(Homo sapiens)
Babasaheb Bhimrao Ambedkar University (A Central University)
Curated by ChEMBL
LigandPNGBDBM50203410(CHEMBL3901489)
Affinity DataIC50:  1.50E+4nM. Assay description: Inhibition of alpha-glucosidase (unknown origin)
In DepthDetails ArticlePubMed
TargetOligo-1,6-glucosidase IMA1(Saccharomyces cerevisiae S288c (Baker's yeast))
Jishou University
Curated by ChEMBL
LigandPNGBDBM50203410(CHEMBL3901489)
Affinity DataIC50:  1.70E+4nM. Assay description: Inhibition of bakers yeast alpha-glucosidase using p-nitrophenyl-alpha-D-glucopyranoside as substrate incubated for 15 mins followed by substrate add...
In DepthDetails ArticlePubMed