BDBM50203516 CHEMBL3967961
SMILES OC(=O)c1ccc(nc1)-n1nc(Oc2c(Cl)cccc2Cl)c2ccccc12
InChI Key InChIKey=ZZAKBDOXLHVGIO-UHFFFAOYSA-N
Data  2 IC50
  Tab Delimited (TSV)   2D SDfile   Computed 3D by Vconf -m prep SDfile
Find this compound or compounds like it in BindingDB:
Activity Spreadsheet -- Enzyme Inhibition Constant Data from BindingDB
Found 2 hits for monomerid = 50203516
TargetNuclear receptor ROR-gamma(Homo sapiens (Human))
Galderma R & D
Curated by ChEMBL
LigandPNGBDBM50203516(CHEMBL3967961)
Affinity DataIC50:  1.10E+3nM. Assay description: Inverse agonist activity at GAL4 DBD-fused RORgammat LBD (unknown origin) expressed in HG5LN cells after 18 hrs by luciferase reporter gene assay
In DepthDetails ArticlePubMed
TargetRetinoic acid receptor gamma(Homo sapiens (Human))
Galderma R & D
Curated by ChEMBL
LigandPNGBDBM50203516(CHEMBL3967961)
Affinity DataIC50:  1.90E+3nM. Assay description: Inverse agonist activity at GAL4 DBD-fused RARgamma LBD (unknown origin) expressed in human HG5LN cells after 18 hrs by luciferase reporter gene assa...
In DepthDetails ArticlePubMed