BDBM50204308 CHEMBL3980626
SMILES [H][C@]12CCN(Cc3cccs3)[C@]3([H])CCC[C@]([H])([C@@H](Cc4ccccc4)C(=O)C1)[C@@]23[H]
InChI Key InChIKey=NXDUDEAVDRLHSA-KIPYVPQSSA-N
Data  4 KI
  Tab Delimited (TSV)   2D SDfile   Computed 3D by Vconf -m prep SDfile
Find this compound or compounds like it in BindingDB:
Activity Spreadsheet -- Enzyme Inhibition Constant Data from BindingDB
Found 4 hits for monomerid = 50204308
TargetSigma non-opioid intracellular receptor 1(Cavia porcellus (Guinea pig))
University Of Kansas
Curated by ChEMBL
LigandPNGBDBM50204308(CHEMBL3980626)
Affinity DataKi:  3nM. Assay description: Displacement of [3H]pentazocine from guinea pig sigma1 receptor measured after 90 mins by microbeta scintillation counting method
In DepthDetails ArticlePubMed
TargetKappa-type opioid receptor(Homo sapiens (Human))
University Of Kansas
Curated by ChEMBL
LigandPNGBDBM50204308(CHEMBL3980626)
Affinity DataKi:  638nM. Assay description: Displacement of [3H]U69593 from KOR (unknown origin) expressed in HEKT cells measured after 90 mins by microbeta scintillation counting method
In DepthDetails ArticlePubMed
TargetDelta-type opioid receptor(Homo sapiens (Human))
University Of Kansas
Curated by ChEMBL
LigandPNGBDBM50204308(CHEMBL3980626)
Affinity DataKi: >1.00E+4nM. Assay description: Displacement of [3H]DADLE from human DOR expressed in HEK cells measured after 90 mins by microbeta scintillation counting method
In DepthDetails ArticlePubMed
TargetMu-type opioid receptor(Homo sapiens (Human))
University Of Kansas
Curated by ChEMBL
LigandPNGBDBM50204308(CHEMBL3980626)
Affinity DataKi: >1.00E+4nM. Assay description: Displacement of [3H]DAMGO from human MOR expressed in HEK cells after 90 mins by microbeta scintillation counting method
In DepthDetails ArticlePubMed