BDBM50204809 (R)-N-(4-(4-hydroxyphenyl)butan-2-yl)-2-(2-phenyl-6-(3-(pyrrolidin-1-yl)propoxy)-1H-indol-3-yl)acetamide::CHEMBL393982
SMILES C[C@H](CCc1ccc(O)cc1)NC(=O)Cc1c([nH]c2cc(OCCCN3CCCC3)ccc12)-c1ccccc1
InChI Key InChIKey=NANWLMQFBRPPCQ-XMMPIXPASA-N
Data  2 IC50
  Tab Delimited (TSV)   2D SDfile   Computed 3D by Vconf -m prep SDfile
Find this compound or compounds like it in BindingDB:
Activity Spreadsheet -- Enzyme Inhibition Constant Data from BindingDB
Found 2 hits for monomerid = 50204809
TargetEstrogen receptor(Homo sapiens (Human))
Merck Research Laboratories
Curated by ChEMBL
LigandPNGBDBM50204809((R)-N-(4-(4-hydroxyphenyl)butan-2-yl)-2-(2-phenyl-...)
Affinity DataIC50:  9.10nM. Assay description: Displacement of [3H]estradiol from full length human recombinant ERalpha after 3 hrs by scintillation proximity assay
In DepthDetails ArticlePubMed
TargetEstrogen receptor beta(Homo sapiens (Human))
Merck Research Laboratories
Curated by ChEMBL
LigandPNGBDBM50204809((R)-N-(4-(4-hydroxyphenyl)butan-2-yl)-2-(2-phenyl-...)
Affinity DataIC50:  2.65E+3nM. Assay description: Displacement of [3H]estradiol from full length human recombinant ERbeta after 3 hrs by scintillation proximity assay
In DepthDetails ArticlePubMed