BDBM50205590 (2S,3S,4R,5R)-5-(6-(4-(2-(3,5-dimethoxyphenylamino)-2-oxoethoxy)phenylamino)-9H-purin-9-yl)-N-ethyl-3,4-dihydroxy-tetrahydrofuran-2-carboxamide::1-deoxy-1-[6-{4-[(3,5-dimethoxy-phenylcarbamoyl)-methoxy]-phenylamino}-9H-purin-9-yl]-N-ethyl-beta-D-ribofuranuronamide::CHEMBL226245
SMILES CCNC(=O)[C@H]1O[C@H]([C@H](O)[C@@H]1O)n1cnc2c(Nc3ccc(OCC(=O)Nc4cc(OC)cc(OC)c4)cc3)ncnc12
InChI Key InChIKey=LNESWMCPNQZUEY-NLJXWPIHSA-N
Data  3 KI  2 EC50
  Tab Delimited (TSV)   2D SDfile   Computed 3D by Vconf -m prep SDfile
Find this compound or compounds like it in BindingDB:
Activity Spreadsheet -- Enzyme Inhibition Constant Data from BindingDB
Found 5 hits for monomerid = 50205590
TargetAdenosine receptor A1(Homo sapiens (Human))
Universit£
Curated by ChEMBL
LigandPNGBDBM50205590((2S,3S,4R,5R)-5-(6-(4-(2-(3,5-dimethoxyphenylamino...)
Affinity DataKi:  15.3nM. Assay description: Displacement of [3H]CHA from human adenosine A1 receptor expressed in CHO cells
In DepthDetails ArticlePubMed
TargetAdenosine receptor A3(Homo sapiens (Human))
Universit£
Curated by ChEMBL
LigandPNGBDBM50205590((2S,3S,4R,5R)-5-(6-(4-(2-(3,5-dimethoxyphenylamino...)
Affinity DataKi:  78.6nM. Assay description: Displacement of [3H]ABMECA from human adenosine A3 receptor expressed in CHO cells
In DepthDetails ArticlePubMed
TargetAdenosine receptor A2a(Homo sapiens (Human))
Universit£
Curated by ChEMBL
LigandPNGBDBM50205590((2S,3S,4R,5R)-5-(6-(4-(2-(3,5-dimethoxyphenylamino...)
Affinity DataKi: >1.00E+3nM. Assay description: Displacement of [3H]CGS-21680 from human adenosine A2A receptor expressed in CHO cells
In DepthDetails ArticlePubMed
TargetAdenosine receptor A2b(Homo sapiens (Human))
Universit£
Curated by ChEMBL
LigandPNGBDBM50205590((2S,3S,4R,5R)-5-(6-(4-(2-(3,5-dimethoxyphenylamino...)
Affinity DataEC50:  53.6nM. Assay description: Agonist activity at human adenosine A2B receptor expressed in CHO cells assessed as stimulation of cAMP production
In DepthDetails ArticlePubMed
TargetAdenosine receptor A2b(Homo sapiens (Human))
Universit£
Curated by ChEMBL
LigandPNGBDBM50205590((2S,3S,4R,5R)-5-(6-(4-(2-(3,5-dimethoxyphenylamino...)
Affinity DataEC50:  1.87E+7nM. Assay description: Agonist activity at human adenosine A2B receptor expressed in CHO cells assessed as stimulation of adenylate cyclase
In DepthDetails ArticlePubMed