BDBM50209724 (R)-N-((R)-7-((ethylamino)methyl)chroman-4-yl)-3-(naphthalene-3-sulfonamido)-3-phenylpropanamide::CHEMBL224071
SMILES CCNCc1ccc2[C@@H](CCOc2c1)NC(=O)C[C@@H](NS(=O)(=O)c1ccc2ccccc2c1)c1ccccc1
InChI Key InChIKey=KNNCFFGIOCEQAR-FQLXRVMXSA-N
Data  1 KI  1 IC50
  Tab Delimited (TSV)   2D SDfile   Computed 3D by Vconf -m prep SDfile
Find this compound or compounds like it in BindingDB:
Activity Spreadsheet -- Enzyme Inhibition Constant Data from BindingDB
Found 2 hits for monomerid = 50209724
TargetB1 bradykinin receptor(Homo sapiens (Human))
Amgen
Curated by ChEMBL
LigandPNGBDBM50209724((R)-N-((R)-7-((ethylamino)methyl)chroman-4-yl)-3-(...)
Affinity DataKi:  8.90nM. Assay description: Displacement of [3H]DAK from human bradykinin B1 receptor expressed in CHOD cells
In DepthDetails ArticlePubMed
TargetB1 bradykinin receptor(Homo sapiens (Human))
Amgen
Curated by ChEMBL
LigandPNGBDBM50209724((R)-N-((R)-7-((ethylamino)methyl)chroman-4-yl)-3-(...)
Affinity DataIC50:  60.2nM. Assay description: Antagonist activity at human bradykinin B1 receptor expressed in CHOD cellsassessed as effect on DAK-induced calcium flux
In DepthDetails ArticlePubMed