BDBM50210322 CHEMBL374743::N-[1-(2-pyrrolidin-1-ylethyl)-1H-benzimidazol-2-yl]acetamide
SMILES CC(=O)Nc1nc2ccccc2n1CCN1CCCC1
InChI Key InChIKey=QUJRVBCKJSMBTH-UHFFFAOYSA-N
Data  1 EC50
  Tab Delimited (TSV)   2D SDfile   Computed 3D by Vconf -m prep SDfile
Find this compound or compounds like it in BindingDB:
Activity Spreadsheet -- Enzyme Inhibition Constant Data from BindingDB
Found 1 hit for monomerid = 50210322
LigandPNGBDBM50210322(CHEMBL374743 | N-[1-(2-pyrrolidin-1-ylethyl)-1H-be...)
Affinity DataEC50: >3.00E+4nM. Assay description: Activity at Kir6.2/SUR1 KATP channels expressed in HEK293 cells assessed as repolarization of tolbutamide-induced membrane depolarization
In DepthDetails ArticlePubMed