BDBM50211231 CHEMBL3945575
SMILES CCOC(=O)c1c(C)n(Cc2ccccc2)c2ccc(OCC(O)CNCC(O)COc3ccc4n(Cc5ccccc5)c(C)c(C(=O)OCC)c4c3)cc12
InChI Key InChIKey=XSFFXIFVRFXHHU-UHFFFAOYSA-N
Data  1 IC50
  Tab Delimited (TSV)   2D SDfile   Computed 3D by Vconf -m prep SDfile
Find this compound or compounds like it in BindingDB:
Activity Spreadsheet -- Enzyme Inhibition Constant Data from BindingDB
Found 1 hit for monomerid = 50211231
TargetQuinolone resistance protein NorA(Staphylococcus aureus)
University Of Perugia
Curated by ChEMBL
LigandPNGBDBM50211231(CHEMBL3945575)
Affinity DataIC50:  1.99E+4nM. Assay description: Inhibition of Staphylococcus aureus 1199B NorA assessed as inhibition of ethidium bromide efflux measured after 5 mins by fluorometric method
In DepthDetails ArticlePubMed