BDBM50212331 5-[1-(3'-adamantan-1-yl-2-chloro-4'-hydroxy-biphenyl-4-yl)-meth-(Z)-ylidene]-thiazolidine-2,4-dione::CHEMBL376571
SMILES OC1=NC(=O)C(S1)=Cc1ccc(c(Cl)c1)-c1ccc(O)c(c1)C12CC3CC(CC(C3)C1)C2
InChI Key InChIKey=CLYLAPYROSOQCD-UHFFFAOYSA-N
Data  2 IC50
  Tab Delimited (TSV)   2D SDfile   Computed 3D by Vconf -m prep SDfile
Find this compound or compounds like it in BindingDB:
Activity Spreadsheet -- Enzyme Inhibition Constant Data from BindingDB
Found 2 hits for monomerid = 50212331
TargetProtein tyrosine phosphatase receptor type C-associated protein(Homo sapiens (Human))
Burnham Institute For Medical Research
Curated by ChEMBL
LigandPNGBDBM50212331(5-[1-(3'-adamantan-1-yl-2-chloro-4'-hydroxy-biphen...)
Affinity DataIC50:  2.30E+3nM. Assay description: Inhibition of CD45 PTP by fluorescence spectrometry
In DepthDetails ArticlePubMed
TargetTyrosine-protein phosphatase non-receptor type 11(Homo sapiens (Human))
Burnham Institute For Medical Research
Curated by ChEMBL
LigandPNGBDBM50212331(5-[1-(3'-adamantan-1-yl-2-chloro-4'-hydroxy-biphen...)
Affinity DataIC50:  2.20E+3nM. Assay description: Inhibition of SHP2 PTP by fluorescence spectroscopy
In DepthDetails ArticlePubMed