BDBM50212607 CHEMBL57330
SMILES CCCN(CCCCNC(=O)c1cc(=O)oc2c3CCCN4CCCc(cc12)c34)C1COc2cccc(OC)c2C1
InChI Key InChIKey=GEDMTUQQRHRNSK-UHFFFAOYSA-N
Data  3 IC50
  Tab Delimited (TSV)   2D SDfile   Computed 3D by Vconf -m prep SDfile
Find this compound or compounds like it in BindingDB:
Activity Spreadsheet -- Enzyme Inhibition Constant Data from BindingDB
Found 3 hits for monomerid = 50212607
Target5-hydroxytryptamine receptor 1A(Homo sapiens (Human))TBA
LigandPNGBDBM50212607(CHEMBL57330)
Affinity DataIC50:  0.300nM. Assay description: The compound was evaluated for its ability to displace [3H]-8-OH-DPAT from 5-hydroxytryptamine 1A receptor in cellular brain membranes
In DepthDetails
Target5-hydroxytryptamine receptor 1B(Homo sapiens (Human))TBA
LigandPNGBDBM50212607(CHEMBL57330)
Affinity DataIC50:  9nM. Assay description: The compound was evaluated for its ability to displace [3H]5-HT from 5-hydroxytryptamine 1B receptor in cellular brain membranes
In DepthDetails
Target5-hydroxytryptamine receptor 2A/2B/2C(Homo sapiens (Human))TBA
LigandPNGBDBM50212607(CHEMBL57330)
Affinity DataIC50:  15nM. Assay description: The compound was evaluated for its ability to displace [3H]ketanserin from 5-hydroxytryptamine 2 receptor in cellular brain membranes
In DepthDetails